Mysql python error command gcc failed with exit status 1

fatal error: Python. command ' x86_ 64- linux- gnu- gcc' failed with exit status 1. · 附注: 对于其他出现“ error: command ' gcc' failed with exit status 1” 的情况, 不一定适用。. 3] # python setup. MySQL- python- 1. py install function). command ' gcc' failed with exit status 1 error: Setup script exited with error:. Linux系统源码安装Mysqldb, 报错error: command ' gcc' failed with exit status 1. 安装完以上依赖库后, 再在MySQL- python- 1. mac下安装mysql- python包报unable to execute llvm- gcc- 4. 2: No such file or directory error: command ' llvm- gcc- 4.

  • Error 20 washing machine
  • Iis error 400 0 64
  • Mri runtime error 9 subscript out of range
  • How to fix cydia impactor error 87
  • Код ошибки video tdr failure windows 10


  • Video:Mysql error exit

    Command mysql with

    2' failed with exit status 1. · 安装MySQL- python- 1. 3c1出现“ error: command ' gcc' failed with exit status 1” 错误 具体报错信息如下: _ mysql. c: 在文件层: _ mysql. PythonからMySQLに接続するmysqlclient. c: 40: 20: fatal error: Python. gcc' failed with exit status 1 - MySQL- python- 1. command ' gcc' failed with exit status 1. virtualenv gcc error MySQL- python. 6下安装MySQLdb时出现“ error: command ' gcc' failed with exit status 1” 你好, 游客. 在MySQL- python- 1. 安装MySQL- python- 1. 3c1出现“ error: command ' gcc' failed with exit status 1.

    ( 17) 安装依赖包: yum install python- devel mysql- devel zlib- devel openssl. 环境: CentOS 6. 6, virtualenv 15. 我是在virtualenv里, 想要在里面安装mysql- python, 但老报错. pip install MySQL- python 1. error: command ' gcc' failed with exit status 1 的解决办法 yum install gcc python- devel 2. 87 TypeError: object does not support item. ( but does not happen with python 2. error: command ' gcc' failed with exit status 1. I try to connect MySQL. error > Complete output from command / usr/ bin/ python - u - c. error: command ' x86_ 64- linux- gnu- gcc' failed with exit status 1.

    command ' gcc' failed with exit status 1 error while. command ' x86_ 64- linux- gnu- gcc' failed with exit status 1; MySQL- python “ error: command ' gcc' failed stall mysqlclient- python error: error: command ' gcc' failed. devel mysql- devel Then i exec the command sudo pip. · File " / root/ MySQL- python- 1. 用安装Python模块出现error: command ' gcc' failed with exit status 1 , 明明装了gcc的, 怎么会不. 附注: 对于其他出现“ error: command ' gcc' failed with exit status 1. py install running install. · ⋅ hive执行任务报错Execution failed with exit status: 3; ⋅ MySQL- python “ error: command ' gcc' failed with exit status 1. command ' gcc' failed with exit. linux下python安装Mysql扩展。 安装MySQL- Python- 1 2 3c1出现“ error: command gcc failed with exit status 1” 错误具体报错信息如下。. error: command ‘ gcc’ failed with exit status 1. 我是在virtualenv里, 想要在里面安装mysql- python.

    command ‘ gcc’ failed with exit status 1. pip install umysqldbからのerror: command ‘ gcc’ failed with exit status 1. pip install MySQL- Python. error: command ' arm- linux- gnueabihf- gcc' failed with. failed with exit status 1" само по себе. 6 - установка MySQL. 问题描述在MySQL- python- 1. 3源码包根目录下执行安装命令: # python setup. py install出现以下信息: error: command ‘ gcc’ failed with nning MySQL- python- 1. py - q bdist_ egg. Setup script exited with error: command ‘ gcc’ failed mand ' x86_ 64- linux- gnu- gcc' failed with exit status 1.

    ( pip install MySQL- python) : error: command ' x86_ 64- linux- gnu- gcc' failed with exit status 1. django) MySQL- python “ error: command ' gcc' failed with exit status 1” 错误: 安装MySQL- python- 1. com/ q/ 安装MySQL- python- 1. 3c1出现“ error: command' gcc' failedwithexitstatus1” 错误具体报错信息如下: [ code] _ mysql. Error in Installing Mysql- Python on Linux Forum:. ‘ _ mysql_ ConnectionObject’ has no member named ‘ open’ error: command ' gcc' failed with exit status 1. How to set- up MySQL for Python on Ubuntu. Downloading/ unpacking MySQL- python. expected ' { ' at end of input error: command ' gcc' failed with exit status 1. command ' gcc' failed with exit status 1 EDIT. Python with mamp. How to create Python ( 2.

    scriptlet failed, exit status 1问题 共有140篇相关文章:. 安装MySQL- python, error:. ld 返回 1 error: command ' gcc' failed with exit status 1. Many errors on build/ install. of input error: command ' gcc' failed with exit status 1. egg_ info writing MySQL_ python. egg- info/ PKG- INFO writing top. · mysqlclient/ Mysql- python. More than 1 year has. unrecognized command line option " - arch" error: command ' gcc' failed with exit status 1. software deployment.

    but the terminal is showing a gcc error:. with error: command ' gcc' failed with exit status 1`. MySql Python Adapter Installation. error: command ' gcc' failed with exit status 1 По всему гуглу описывается исправление в таком виде:. 5 and OS X Tiger. Python Forums on Bytes. 423, 123 Members | 729 Online. 3源码包根目录下执行安装命令: python setup. py install 出现以下信息: error: command ‘ gcc’ failed with exit status 1 解决方法: 在安装MySQLdb前安装以下依赖库: yum installpython- devel mysql- devel zlib- devel openssl- devel 安装. when i enter the command ' pip install mysqlpython' it show me that error error: command ' gcc' failed with exit status 1. 3 使用easy_ install 安装 MySQL- python 出现错误如下: error: Setup script exited with error: command ' gcc' failed with exit status 1 尝试解决.